{"text_format":"1","workbook":"xlsx","n_sheets":12,"sheets":["ТИТУЛ","РОЗПОДІЛ","НАВЧАЛЬНА РОБОТА","МЕТОД+НАУК+ОРГАН","ЗМІНИ ТА ВИСНОВКИ","метод","наук","органз","СПИСКИ","Лист2","Лист3","Лист4"],"not_rendered":{"charts":0,"images":0,"macros":1,"external_links":0,"defined_names":23,"comments":0,"pivot_tables":0},"unopened":[],"bounds":{"document_bytes":16777216,"sheet_cells":100000,"rows_first":2000,"rows_last":500,"rows_between":2000,"halvings":0,"cell_chars":16384,"cell_head_chars":4096},"cells_cut":0,"cells_raw":0,"read":"whole","date_system":"1900"}

{"sheet":"ТИТУЛ","index":0,"n_rows":36,"n_cols":14,"rows_kept":36,"cut":false,"hidden":false,"merged":[[33,5,33,6],[7,12,8,12],[7,13,8,13],[11,12,12,12],[11,13,12,13],[23,12,24,12],[23,13,24,13],[33,12,34,12],[24,0,24,6],[34,5,34,6],[32,4,32,6],[0,0,0,6],[18,0,18,6],[19,0,19,6],[23,0,23,6],[10,0,11,0],[8,1,8,5],[11,1,11,5]]}
["МІНІСТЕРСТВО ОСВІТИ І НАУКИ УКРАЇНИ                                                                                                                     ХАРКІВСЬКИЙ НАЦІОНАЛЬНИЙ ЕКОНОМІЧНИЙ УНІВЕРСИТЕТ                                      ІМЕНІ СЕМЕНА КУЗНЕЦЯ"]
[null,null,null,null,null,null,null,{"$f":"VLOOKUP(B9,СПИСКИ!$A$3:$B$9,2,FALSE)","v":201},{"$f":"VLOOKUP(H2,СПИСКИ!$D$3:$E$38,2,FALSE)","v":"Фінансів"},1,"2017 / 2018",{"$f":"IFERROR(I2,\" \")","v":"Фінансів"}]
[null,null,null,null,null,null,null,{"$f":"H2+1","v":202},{"$f":"VLOOKUP(H3,СПИСКИ!$D$3:$E$38,2,FALSE)","v":"Митної справи і фінансових послуг"},0.75,"2018/ 2019","Митної справи і фінансових послуг"]
[null,null,null,null,null,null,null,{"$f":"H3+1","v":203},{"$f":"VLOOKUP(H4,СПИСКИ!$D$3:$E$38,2,FALSE)","v":"Обліку і бізнес-консалтингу"},0.5,"2019/ 2020","Обліку і бізнес-консалтингу"]
[null,null,null,null,null,null,null,204,{"$f":"VLOOKUP(H5,СПИСКИ!$D$3:$E$38,2,FALSE)","v":"Вищої математики та економіко-математичних методів"},0.25,"2020 / 2021","Вищої математики та економіко-математичних методів"]
[null,null,null,null,null,null,null,205,{"$f":"VLOOKUP(H6,СПИСКИ!$D$3:$E$38,2,FALSE)","v":{"$error":"#N/A"}},null,"2021/2022"," "]
[null,null,null,null,null,null,null,206,{"$f":"VLOOKUP(H7,СПИСКИ!$D$3:$E$38,2,FALSE)","v":{"$error":"#N/A"}},null,"2022/2023"," "]
[null,null,null,null,null,null,null,null,null,null,"2023/2024",0,"E","Вибрати з випадаючого списку"]
["Факультет","Фінансів і обліку"]
[]
["Кафедра"]
[null,"Обліку і бізнес-консалтингу",null,null,null,null,null,null,null,null,null,null,"E","Вибрати з випадаючого списку"]
[]
[]
[]
[]
[]
[]
["ІНДИВІДУАЛЬНИЙ ПЛАН"]
["РОБОТИ ВИКЛАДАЧА ТА ЇЇ ОБЛІК"]
{"$rows_left_out":17}
{"sheet":"РОЗПОДІЛ","index":1,"n_rows":31,"n_cols":8,"rows_kept":31,"cut":false,"hidden":false,"merged":[[30,0,30,4],[8,0,8,4],[24,0,24,1],[0,2,1,4],[2,1,2,4],[3,0,3,4],[4,0,4,4],[5,0,5,4],[9,0,9,4],[24,6,25,6],[24,7,25,7],[10,0,10,4],[12,0,12,4],[13,0,13,2],[14,0,14,2],[16,0,16,2],[17,0,17,2],[18,0,18,2],[15,0,15,2],[21,0,21,4],[22,0,22,4]]}
[]
[null,null,null,null,null,null,{"$f":"ТИТУЛ!E34*1548","v":0}," - загальна кількость годин"]
[]
[]
[]
[]
[]
[]
[]
[]
["РОЗПОДІЛ ЗАГАЛЬНОГО РОБОЧОГО ЧАСУ"]
[]
["Повний обсяг роботи за індивідуальним планом:"]
["За видами робіт:",null,null,"План","Факт"]
["І. Навчальна",null,null,{"$f":"'НАВЧАЛЬНА РОБОТА'!AA68","v":0},{"$f":"'НАВЧАЛЬНА РОБОТА'!AB68","v":0}]
["ІІ. Методична",null,null,{"$f":"'МЕТОД+НАУК+ОРГАН'!E18","v":0},{"$f":"'МЕТОД+НАУК+ОРГАН'!F18","v":0}]
["ІII. Наукова",null,null,{"$f":"'МЕТОД+НАУК+ОРГАН'!E30","v":0},{"$f":"'МЕТОД+НАУК+ОРГАН'!F30","v":0}]
["IV. Організаційна",null,null,{"$f":"'МЕТОД+НАУК+ОРГАН'!E39","v":0},{"$f":"'МЕТОД+НАУК+ОРГАН'!F39","v":0}]
["Загальна кількість годин",null,null,{"$f":"SUM(D15:D18)","v":0},{"$f":"SUM(E15:E18)","v":0},null,{"$f":"G2-D19","v":0},{"$f":"IF(G19=0,0,\"- відхілення від норматива\")","v":0}]
[]
{"$rows_left_out":12}
{"sheet":"НАВЧАЛЬНА РОБОТА","index":2,"n_rows":78,"n_cols":30,"rows_kept":78,"cut":false,"hidden":false,"merged":[[21,0,32,0],[34,0,49,0],[67,0,67,7],[33,0,33,7],[62,0,62,7],[63,0,63,13],[66,0,66,13],[64,0,64,7],[65,0,65,7],[50,0,61,0],[49,1,49,7],[61,1,61,7],[1,0,3,0],[1,18,2,19],[1,22,2,23],[63,14,63,27],[66,14,66,27],[1,26,2,27],[1,24,2,25],[1,20,2,21],[32,1,32,7],[1,16,2,17],[1,4,3,4],[4,0,20,0],[20,1,20,7],[1,8,2,9],[1,1,3,1],[1,2,3,2],[1,3,3,3],[1,5,3,5],[1,6,3,6],[1,14,2,15],[1,10,2,11],[1,12,2,13],[1,7,3,7]]}
["І. НАВЧАЛЬНА РОБОТА"]
["Форма навчання","№ п/п","Назва навчальних дисциплін і видів навчальної роботи","Спеціальність, факультет","Мова навчання","Курс навчання","Кількість студентів","Шифр груп (потоків)","Читання лекцій",null,"Проведення практичних (семінарських) занять",null,"Проведення лабораторних занять",null,"Проведення екзаменаційних консультацій",null,"Керівництво і прийняття курсових проектів, робіт ",null,"Керівництво навчальною                  і виробничою практикою",null,"Участь в ЕК",null,"Проведення кваліфікаційного іспита за спеціальністю/ вступних випробувань",null,"Керівництво, консультування, рецензування та проведення захисту дипломних проектів (робіт)",null,"УСЬОГО"]
[]
[null,null,null,null,null,null,null,null,"план","факт","план","факт","план","факт","план","факт","план","факт","план","факт","план","факт","план","факт","план","факт","план","факт"]
["очна (денна)",{"$f":"IF(C5=0,0,1)","v":0},null,null,null,null,null,null,null,null,null,null,null,null,null,null,null,null,null,null,null,null,null,null,null,null,{"$f":"I5+K5+M5+O5+Q5+S5+U5+W5+Y5","v":0},{"$f":"J5+L5+N5+P5+R5+T5+V5+X5+Z5","v":0}]
[null,{"$f":"IF(C6=0,0,1)","v":0},null,null,null,null,null,null,null,null,null,null,null,null,null,null,null,null,null,null,null,null,null,null,null,null,{"$f":"I6+K6+M6+O6+Q6+S6+U6+W6+Y6","v":0},{"$f":"J6+L6+N6+P6+R6+T6+V6+X6+Z6","v":0}]
[null,{"$f":"IF(C7=0,0,1)","v":0},null,null,null,null,null,null,null,null,null,null,null,null,null,null,null,null,null,null,null,null,null,null,null,null,0,0]
[null,0,null,null,null,null,null,null,null,null,null,null,null,null,null,null,null,null,null,null,null,null,null,null,null,null,0,0]
[null,0,null,null,null,null,null,null,null,null,null,null,null,null,null,null,null,null,null,null,null,null,null,null,null,null,0,0]
[null,0,null,null,null,null,null,null,null,null,null,null,null,null,null,null,null,null,null,null,null,null,null,null,null,null,0,0]
[null,0,null,null,null,null,null,null,null,null,null,null,null,null,null,null,null,null,null,null,null,null,null,null,null,null,0,0]
[null,0,null,null,null,null,null,null,null,null,null,null,null,null,null,null,null,null,null,null,null,null,null,null,null,null,0,0]
[null,0,null,null,null,null,null,null,null,null,null,null,null,null,null,null,null,null,null,null,null,null,null,null,null,null,0,0]
[null,0,null,null,null,null,null,null,null,null,null,null,null,null,null,null,null,null,null,null,null,null,null,null,null,null,0,0]
[null,0,null,null,null,null,null,null,null,null,null,null,null,null,null,null,null,null,null,null,null,null,null,null,null,null,0,0]
[null,0,null,null,null,null,null,null,null,null,null,null,null,null,null,null,null,null,null,null,null,null,null,null,null,null,0,0]
[null,0,null,null,null,null,null,null,null,null,null,null,null,null,null,null,null,null,null,null,null,null,null,null,null,null,0,0]
[null,0,null,null,null,null,null,null,null,null,null,null,null,null,null,null,null,null,null,null,null,null,null,null,null,null,0,0]
[null,0,null,null,null,null,null,null,null,null,null,null,null,null,null,null,null,null,null,null,null,null,null,null,null,null,0,0]
[null,0,null,null,null,null,null,null,null,null,null,null,null,null,null,null,null,null,null,null,null,null,null,null,null,null,0,0]
{"$rows_left_out":59}
{"sheet":"МЕТОД+НАУК+ОРГАН","index":3,"n_rows":40,"n_cols":7,"rows_kept":40,"cut":false,"hidden":false,"merged":[[18,1,18,4],[30,1,30,4],[39,1,39,4]]}
[null,"II.  МЕТОДИЧНА   РОБОТА"]
["№   п/п","Зміст","Підсумковий результат","Термін виконання","Плановий обсяг,                                год","Фактичний обсяг,                    год","ВВЕДІТЬ НОМЕР\nВІД 1-126"]
[{"$f":"IF(B3=0,0,1)","v":1},{"$f":"IFERROR(VLOOKUP(G3,метод!$C$14:$D$141,2,FALSE),\" \")","v":" "}]
[{"$f":"IF(B4=\" \",\" \",A3+1)","v":" "},{"$f":"IFERROR(VLOOKUP(G4,метод!$C$14:$D$128,2,FALSE),\" \")","v":" "}]
[{"$f":"IF(B5=\" \",\" \",A4+1)","v":" "},{"$f":"IFERROR(VLOOKUP(G5,метод!$C$14:$D$128,2,FALSE),\" \")","v":" "}]
[" ",{"$f":"IFERROR(VLOOKUP(G6,метод!$C$14:$D$128,2,FALSE),\" \")","v":" "}]
[" ",{"$f":"IFERROR(VLOOKUP(G7,метод!$C$14:$D$128,2,FALSE),\" \")","v":" "}]
[" ",{"$f":"IFERROR(VLOOKUP(G8,метод!$C$14:$D$128,2,FALSE),\" \")","v":" "}]
[{"$f":"IF(B9=\" \",\" \",A8+1)","v":" "},{"$f":"IFERROR(VLOOKUP(G9,метод!$C$14:$D$128,2,FALSE),\" \")","v":" "}]
[" ",{"$f":"IFERROR(VLOOKUP(G10,метод!$C$14:$D$128,2,FALSE),\" \")","v":" "}]
[" ",{"$f":"IFERROR(VLOOKUP(G11,метод!$C$14:$D$128,2,FALSE),\" \")","v":" "}]
[{"$f":"IF(B12=\" \",\" \",A11+1)","v":" "},{"$f":"IFERROR(VLOOKUP(G12,метод!$C$14:$D$128,2,FALSE),\" \")","v":" "}]
[" ",{"$f":"IFERROR(VLOOKUP(G13,метод!$C$14:$D$128,2,FALSE),\" \")","v":" "}]
[" ",{"$f":"IFERROR(VLOOKUP(G14,метод!$C$14:$D$128,2,FALSE),\" \")","v":" "}]
[" ",{"$f":"IFERROR(VLOOKUP(G15,метод!$C$14:$D$128,2,FALSE),\" \")","v":" "}]
[{"$f":"IF(B16=\" \",\" \",A15+1)","v":" "},{"$f":"IFERROR(VLOOKUP(G16,метод!$C$14:$D$128,2,FALSE),\" \")","v":" "}]
[" ",{"$f":"IFERROR(VLOOKUP(G17,метод!$C$14:$D$128,2,FALSE),\" \")","v":" "}]
[null,null,null,"Загальна кількість годин",{"$f":"SUM(E3:E17)","v":0},{"$f":"SUM(F3:F17)","v":0}]
[null,{"$f":"CONCATENATE(\"Викладач ______________      Завідувач кафедри  ____________       / \",'НАВЧАЛЬНА РОБОТА'!AD70,\" /\")","v":"Викладач ______________      Завідувач кафедри  ____________       / Пилипенко А.А. /"}]
[null,"ІІІ. НАУКОВА РОБОТА"]
{"$rows_left_out":21}
{"sheet":"ЗМІНИ ТА ВИСНОВКИ","index":4,"n_rows":21,"n_cols":7,"rows_kept":21,"cut":false,"hidden":false,"merged":[[23,1,23,5],[24,1,24,5],[25,1,25,5],[26,1,26,5],[27,1,27,5],[22,1,22,5],[19,0,19,6],[0,0,0,5],[11,1,11,5],[12,1,12,5],[13,1,13,5],[14,1,14,5],[10,0,10,6],[15,1,15,5],[16,1,16,5],[17,1,17,5],[20,1,20,5],[21,1,21,5]]}
["V. ПЕРЕЛІК ЗМІН У ПЛАНІ РОБОТИ ВИКЛАДАЧА"]
["Семестр","Види навчальної роботи ","Сутність запроваджених змін в навчальних дисциплінах і видах навчальної роботи та їх обґрунтування","Плановий обсяг,                                год","Фактичний обсяг,                    год","Підстава                                                  (накази, розпорядження, протоколи засідань кафедри, лікарняні листи)","Підпис  завідувача кафедри"]
[]
[]
[]
[]
[]
[]
[]
[]
["VI.  ВИСНОВОК ПРО ВИКОНАННЯ ПЛАНУ"]
["Семестр","Зміст",null,null,null,null,"Підпис  завідувача кафедри"]
[null,{"$f":"CONCATENATE(\"Звіт про виконання індивідуального плану за \",ТИТУЛ!A34,\" навчальний рік викладача \",ТИТУЛ!A24,\" розглянуто ___  _____________ 20__ р. на засіданні кафедри \",ТИТУЛ!B12,\" й ухвалено рішення (протокол №______): Індивідуальний план виконано в обсязі \",РОЗПОДІЛ!E19,\" годин.\")","v":"Звіт про виконання індивідуального плану за 2023/2024 навчальний рік викладача  розглянуто ___  _____________ 20__ р. на засіданні кафедри Обліку і бізнес-консалтингу й ухвалено рішення (протокол №______): Індивідуальний план виконано в обсязі 0 годин."}]
[null,"Пояснення щодо причин недовиконання:"]
[]
[]
[]
[]
[]
["VII. ЗАУВАЖЕННЯ ОСІБ, ЯКІ ПЕРЕВІРЯЮТЬ РОБОТУ КАФЕДРИ "]
{"$rows_left_out":2}
{"sheet":"метод","index":5,"n_rows":141,"n_cols":4,"rows_kept":141,"cut":false,"hidden":false,"merged":[]}
[]
["ПП","ПЕРЕЛІК МЕТОДИЧНИХ РОБІТ","номер"]
[]
[]
[]
[]
[]
[]
[]
[]
[]
[]
["ПП","ПЕРЕЛІК МЕТОДИЧНИХ РОБІТ","номер"]
["1.1.1","Розроблення освітньо-професійної та/ або освітньо-наукової програм підготовки фахівців: розроблення",1,{"$f":"CONCATENATE(A14,\" \", B14)","v":"1.1.1 Розроблення освітньо-професійної та/ або освітньо-наукової програм підготовки фахівців: розроблення"}]
["1.1.2","Розроблення освітньо-професійної та/ або освітньо-наукової програм підготовки фахівців: оновлення",2,{"$f":"CONCATENATE(A15,\" \", B15)","v":"1.1.2 Розроблення освітньо-професійної та/ або освітньо-наукової програм підготовки фахівців: оновлення"}]
["1.2","Розроблення концепції освітньої діяльності за спеціальністю на певному рівні",3,"1.2 Розроблення концепції освітньої діяльності за спеціальністю на певному рівні"]
["1.3","Підготовка ліцензійних справ",4,"1.3 Підготовка ліцензійних справ"]
["1.4","Підготовка акредитаційних справ",5,"1.4 Підготовка акредитаційних справ"]
["1.5.1","Підготовка навчальних планів відповідної освітньо-професійної та освітньо-наукової програми",6,"1.5.1 Підготовка навчальних планів відповідної освітньо-професійної та освітньо-наукової програми"]
["1.5.2","Підготовка робочих навчальних планів відповідної освітньо-професійної та освітньо-наукової програми",7,"1.5.2 Підготовка робочих навчальних планів відповідної освітньо-професійної та освітньо-наукової програми"]
{"$rows_left_out":122}
{"sheet":"наук","index":6,"n_rows":88,"n_cols":4,"rows_kept":88,"cut":false,"hidden":false,"merged":[]}
[]
["ПП","ПЕРЕЛІК НАУКОВИХ РОБІТ","номер"]
[]
[]
[]
[]
[]
[]
[]
[]
[]
[]
["ПП","ПЕРЕЛІК НАУКОВИХ РОБІТ","номер"]
["1.1.1","Виконання затверджених планових наукових досліджень: керівнику",201,{"$f":"CONCATENATE(A14,\" \",B14)","v":"1.1.1 Виконання затверджених планових наукових досліджень: керівнику"}]
["1.1.2","Виконання затверджених планових наукових досліджень: виконавцю",202,{"$f":"CONCATENATE(A15,\" \",B15)","v":"1.1.2 Виконання затверджених планових наукових досліджень: виконавцю"}]
["1.2","Підготовка проєктних пропозицій на конкурс / грант, який проводять на вітчизняному або міжнародному рівні ",203,"1.2 Підготовка проєктних пропозицій на конкурс / грант, який проводять на вітчизняному або міжнародному рівні "]
["1.3.1","Винахідницька робота викладача: міжнародні патенти",204,"1.3.1 Винахідницька робота викладача: міжнародні патенти"]
["1.3.2","Винахідницька робота викладача:  патенти",205,"1.3.2 Винахідницька робота викладача:  патенти"]
["1.3.3","Винахідницька робота викладача:  патенти на корисну модель",206,"1.3.3 Винахідницька робота викладача:  патенти на корисну модель"]
["1.3.4","Винахідницька робота викладача:  свідоцтва на твір",207,"1.3.4 Винахідницька робота викладача:  свідоцтва на твір"]
{"$rows_left_out":69}
{"sheet":"органз","index":7,"n_rows":76,"n_cols":4,"rows_kept":76,"cut":false,"hidden":false,"merged":[]}
[]
["ПП","ПЕРЕЛІК ОРГАНІЗАЦІЙНИХ РОБІТ","номер"]
[]
[]
[]
[]
[]
[]
[]
[]
[]
[]
["ПП","ПЕРЕЛІК ОРГАНІЗАЦІЙНИХ РОБІТ","номер"]
["1.1.1","Участь у підготовці та проведенні студентських та учнівських олімпіад: робота в організаційному комітеті",301,{"$f":"CONCATENATE(A14,\" \", B14)","v":"1.1.1 Участь у підготовці та проведенні студентських та учнівських олімпіад: робота в організаційному комітеті"}]
["1.1.2","Участь у підготовці та проведенні студентських та учнівських олімпіад: проведення олімпіад",302,{"$f":"CONCATENATE(A15,\" \", B15)","v":"1.1.2 Участь у підготовці та проведенні студентських та учнівських олімпіад: проведення олімпіад"}]
["1.1.3","Участь у підготовці та проведенні студентських та учнівських олімпіад: перевірка робіт учасника олімпіади",303,"1.1.3 Участь у підготовці та проведенні студентських та учнівських олімпіад: перевірка робіт учасника олімпіади"]
["1.2","Участь у міжнародних Літніх школах, семінарах під патронатом МОН України, ЄС чи університетів-партнерів ХНЕУ ім. С. Кузнеця ",304,"1.2 Участь у міжнародних Літніх школах, семінарах під патронатом МОН України, ЄС чи університетів-партнерів ХНЕУ ім. С. Кузнеця "]
["1.3","Організація та проведення освітніх та наукових заходів (конференцій, круглих столів, тематичних дискусій, конкурсів наукових робіт тощо)",305,"1.3 Організація та проведення освітніх та наукових заходів (конференцій, круглих столів, тематичних дискусій, конкурсів наукових робіт тощо)"]
["2.1","Організація та проведення культурно-мистецьких, спортивних заходів для студентів у позанавчальний час ",306,"2.1 Організація та проведення культурно-мистецьких, спортивних заходів для студентів у позанавчальний час "]
["2.2","Організація та проведення культурно-мистецьких, спортивних заходів для НПП і співробітників університету",307,"2.2 Організація та проведення культурно-мистецьких, спортивних заходів для НПП і співробітників університету"]
{"$rows_left_out":57}
{"sheet":"СПИСКИ","index":8,"n_rows":30,"n_cols":11,"rows_kept":30,"cut":false,"hidden":false,"merged":[]}
["ФАКУЛЬТЕТИ","код","Декани","код","КАФЕДРИ","Завідувачі кафедр","ПОСАДИ","ВЧЕНЕ ЗВАННЯ","Примітка","Підсумковий результат ","Термін виконання"]
[]
["Міжнародних відносин і журналістики",101,"Чернишов В.В.",101,"Міжнародних економічних відносин","Отенко І.П.","Завідувач кафедри","Професор","Зовнішній сумісник","Друкована праця","I семестр"]
["Фінансів і обліку",201,"Проноза П.В.",102,"Управління соціальними комунікаціями","Яресько К.В.","Професор","Доцент","Внутрішній сумісник","Рукопис","II семестр"]
["Менеджменту і маркетингу",301,"Вовк В.А.",103,"Міжнародних відносин, політичних наук і практичної філософії","Кузь О.М.","Доцент","Старший науковий співробітник",null,null,"Протягом року"]
["Інформаційних технологій",401,"Коц Г.П.",104,"Педагогіки, іноземної філології та переводу","Погорєлова Т. Ю.","Старший викладач","Старший дослідник"]
["Економіки і права",501,"Бріль М.С.",201,"Фінансів","Журавльова І.В.","Викладач"]
["Міжнародної економіки і підприємництва",601,"Проскурніна Н.В.",202,"Митної справи і фінансових послуг","Тищенко В.Ф."]
["Підготовки іноземних громадян",701,"Єрмоленко О.А.",203,"Обліку і бізнес-консалтингу","Пилипенко А.А."]
[null,null,null,204,"Вищої математики та економіко-математичних методів","Малярець Л.М."]
[null,null,null,301,"Менеджменту, логістики та інновацій","Ястремська О.М."]
[null,null,null,302,"Менеджменту та бізнесу","Лепейко Т.І."]
[null,null,"Шталь Т.В.",303,"Маркетингу","Гриневич Л.В."]
[null,null,null,401,"Інформаційних систем","Бондаренко Д. О."]
[null,null,null,402,"Комп’ютерних систем і технологій ","Пушкар О.І."]
[null,null,null,403,"Економічної кібернетики і системного аналізу","Гур’янова Л.С."]
[null,null,null,404,"Інформатики та комп’ютерної техніки ","Удовенко С.Г."]
[null,null,null,405,"Кібербезпеки та інформаційних технологій","Старкова О.В."]
[null,null,null,501,"Соціальної економіки","Назарова Г.В."]
[null,null,null,502,"Економіки підприємства та організації бізнесу","Власенко Т.А."]
{"$rows_left_out":11}
{"sheet":"Лист2","index":9,"n_rows":0,"n_cols":0,"rows_kept":0,"cut":false,"hidden":true,"merged":[]}

{"sheet":"Лист3","index":10,"n_rows":0,"n_cols":0,"rows_kept":0,"cut":false,"hidden":true,"merged":[]}

{"sheet":"Лист4","index":11,"n_rows":0,"n_cols":0,"rows_kept":0,"cut":false,"hidden":true,"merged":[]}