{"text_format":"1","workbook":"xlsx","n_sheets":9,"sheets":["ТИТУЛ","РОЗПОДІЛ","НАВЧАЛЬНА РОБОТА","МЕТОД+НАУК+ОРГАН","ЗМІНИ ТА ВИСНОВКИ","метод","наук","органз","СПИСКИ"],"not_rendered":{"charts":0,"images":0,"macros":1,"external_links":0,"defined_names":23,"comments":0,"pivot_tables":0},"unopened":[],"bounds":{"document_bytes":16777216,"sheet_cells":100000,"rows_first":2000,"rows_last":500,"rows_between":2000,"halvings":0,"cell_chars":16384,"cell_head_chars":4096},"cells_cut":0,"cells_raw":0,"read":"whole","date_system":"1900"}

{"sheet":"ТИТУЛ","index":0,"n_rows":36,"n_cols":14,"rows_kept":36,"cut":false,"hidden":false,"merged":[[33,5,33,6],[7,12,8,12],[7,13,8,13],[11,12,12,12],[11,13,12,13],[23,12,24,12],[23,13,24,13],[33,12,34,12],[24,0,24,6],[34,5,34,6],[32,4,32,6],[33,0,35,0],[35,5,35,6],[0,0,0,6],[18,0,18,6],[19,0,19,6],[23,0,23,6],[10,0,11,0],[8,1,8,5],[11,1,11,5]]}
["МІНІСТЕРСТВО ОСВІТИ І НАУКИ УКРАЇНИ                                                                                                                     ХАРКІВСЬКИЙ НАЦІОНАЛЬНИЙ ЕКОНОМІЧНИЙ УНІВЕРСИТЕТ                                      ІМЕНІ СЕМЕНА КУЗНЕЦЯ"]
[null,null,null,null,null,null,null,{"$f":"VLOOKUP(B9,СПИСКИ!$A$3:$B$8,2,FALSE)","v":301},{"$f":"VLOOKUP(H2,СПИСКИ!$D$3:$E$39,2,FALSE)","v":"Менеджменту, логістики та інновацій"},1,"2024/2025",{"$f":"IFERROR(I2,\" \")","v":"Менеджменту, логістики та інновацій"}]
[null,null,null,null,null,null,null,{"$f":"H2+1","v":302},{"$f":"VLOOKUP(H3,СПИСКИ!$D$3:$E$39,2,FALSE)","v":"Менеджменту, бізнесу і адміністрування"},0.75,"2025/2026","Менеджменту, бізнесу і адміністрування"]
[null,null,null,null,null,null,null,{"$f":"H3+1","v":303},{"$f":"VLOOKUP(H4,СПИСКИ!$D$3:$E$39,2,FALSE)","v":"Маркетингу"},0.5,"2026/2027","Маркетингу"]
[null,null,null,null,null,null,null,304,{"$f":"VLOOKUP(H5,СПИСКИ!$D$3:$E$39,2,FALSE)","v":"Бізнес-журналістики і цифрових медіа"},0.25,"2027/2028","Бізнес-журналістики і цифрових медіа"]
[null,null,null,null,null,null,null,305,{"$f":"VLOOKUP(H6,СПИСКИ!$D$3:$E$39,2,FALSE)","v":"Психології і соціології"},null,"2028/2029","Психології і соціології"]
[null,null,null,null,null,null,null,306,{"$f":"VLOOKUP(H7,СПИСКИ!$D$3:$E$39,2,FALSE)","v":"Креативного менеджменту і дизайну"},null,"2029/2030","Креативного менеджменту і дизайну"]
[null,null,null,null,null,null,null,307,{"$f":"VLOOKUP(H8,СПИСКИ!$D$3:$E$39,2,FALSE)","v":{"$error":"#N/A"}},null,"2030/2031"," ","E","Вибрати з випадаючого списку"]
["Інститут / Факультет","Менеджменту і маркетингу",null,null,null,null,null,308,{"$f":"VLOOKUP(H9,СПИСКИ!$D$3:$E$39,2,FALSE)","v":{"$error":"#N/A"}},null,null," "]
[null,null,null,null,null,null,null,null,null,null,null,0]
["Кафедра",null,null,null,null,null,null,null,null,null,null,0]
[null,"Креативного менеджменту і дизайну",null,null,null,null,null,null,null,null,null,0,"E","Вибрати з випадаючого списку"]
[]
[]
[]
[]
[]
[]
["ІНДИВІДУАЛЬНИЙ ПЛАН"]
["РОБОТИ ВИКЛАДАЧА "]
{"$rows_left_out":17}
{"sheet":"РОЗПОДІЛ","index":1,"n_rows":31,"n_cols":8,"rows_kept":31,"cut":false,"hidden":false,"merged":[[8,0,8,4],[24,0,24,1],[0,2,1,4],[2,1,2,4],[3,0,3,4],[4,0,4,4],[5,0,5,4],[9,0,9,4],[31,0,31,4],[24,6,25,6],[24,7,25,7],[10,0,10,4],[12,0,12,4],[13,0,13,2],[14,0,14,2],[16,0,16,2],[17,0,17,2],[18,0,18,2],[15,0,15,2],[21,0,21,4],[22,0,22,4],[30,0,30,4]]}
[]
[null,null,null,null,null,null,{"$f":"ТИТУЛ!E34*1548","v":0}," - загальна кількость годин"]
[]
[]
[]
[]
[]
[]
[]
[]
["РОЗПОДІЛ ЗАГАЛЬНОГО РОБОЧОГО ЧАСУ"]
[]
["Повний обсяг роботи за індивідуальним планом:"]
["За видами робіт:",null,null,"План","Факт"]
["І. Навчальна",null,null,{"$f":"'НАВЧАЛЬНА РОБОТА'!AA68","v":0},{"$f":"'НАВЧАЛЬНА РОБОТА'!AB68","v":0},{"$f":"E19*30/100","v":0},"не більше 30%"]
["ІІ. Методична",null,null,{"$f":"'МЕТОД+НАУК+ОРГАН'!E18","v":0},{"$f":"'МЕТОД+НАУК+ОРГАН'!F18","v":0}]
["ІII. Наукова",null,null,{"$f":"'МЕТОД+НАУК+ОРГАН'!E30","v":0},{"$f":"'МЕТОД+НАУК+ОРГАН'!F30","v":0},{"$f":"E19*30/100","v":0},"не менше 30%"]
["IV. Організаційна",null,null,{"$f":"'МЕТОД+НАУК+ОРГАН'!E39","v":0},{"$f":"'МЕТОД+НАУК+ОРГАН'!F39","v":0}]
["Загальна кількість годин",null,null,{"$f":"SUM(D15:D18)","v":0},{"$f":"SUM(E15:E18)","v":0},null,{"$f":"G2-D19","v":0},{"$f":"IF(G19=0,0,\"- відхілення від норматива\")","v":0}]
[]
{"$rows_left_out":12}
{"sheet":"НАВЧАЛЬНА РОБОТА","index":2,"n_rows":73,"n_cols":30,"rows_kept":73,"cut":false,"hidden":false,"merged":[[21,0,32,0],[34,0,49,0],[67,0,67,7],[33,0,33,7],[62,0,62,7],[63,0,63,13],[66,0,66,13],[64,0,64,7],[65,0,65,7],[50,0,61,0],[49,1,49,7],[61,1,61,7],[1,0,3,0],[1,18,2,19],[1,22,2,23],[63,14,63,27],[66,14,66,27],[1,26,2,27],[1,24,2,25],[1,20,2,21],[32,1,32,7],[1,16,2,17],[1,4,3,4],[4,0,20,0],[20,1,20,7],[1,8,2,9],[1,1,3,1],[1,2,3,2],[1,3,3,3],[1,5,3,5],[1,6,3,6],[1,14,2,15],[1,10,2,11],[1,12,2,13],[1,7,3,7]]}
["І. НАВЧАЛЬНА РОБОТА"]
["Форма навчання","№ п/п","Назва навчальних дисциплін і видів навчальної роботи","Спеціальність, інститут /факультет","Мова навчання","Курс навчання","Кількість здобувачів","Шифр груп (потоків)","Читання лекцій",null,"Проведення практичних (семінарських) занять",null,"Проведення лабораторних занять",null,"Проведення екзаменаційних консультацій",null,"Керівництво і прийняття курсових проєктів, робіт ",null,"Керівництво навчальною                  і виробничою практикою",null,"Участь в ЕК",null,"Проведення кваліфікаційного іспита за спеціальністю/ вступних випробувань",null,"Керівництво, консультування, рецензування та проведення захисту дипломних проєктів (робіт)",null,"УСЬОГО"]
[]
[null,null,null,null,null,null,null,null,"план","факт","план","факт","план","факт","план","факт","план","факт","план","факт","план","факт","план","факт","план","факт","план","факт"]
["очна (денна)",{"$f":"IF(C5=0,0,1)","v":0},null,null,null,null,null,null,null,null,null,null,null,null,null,null,null,null,null,null,null,null,null,null,null,null,{"$f":"I5+K5+M5+O5+Q5+S5+U5+W5+Y5","v":0},{"$f":"J5+L5+N5+P5+R5+T5+V5+X5+Z5","v":0}]
[null,{"$f":"IF(C6=0,0,1)","v":0},null,null,null,null,null,null,null,null,null,null,null,null,null,null,null,null,null,null,null,null,null,null,null,null,{"$f":"I6+K6+M6+O6+Q6+S6+U6+W6+Y6","v":0},{"$f":"J6+L6+N6+P6+R6+T6+V6+X6+Z6","v":0}]
[null,{"$f":"IF(C7=0,0,1)","v":0},null,null,null,null,null,null,null,null,null,null,null,null,null,null,null,null,null,null,null,null,null,null,null,null,0,0]
[null,0,null,null,null,null,null,null,null,null,null,null,null,null,null,null,null,null,null,null,null,null,null,null,null,null,0,0]
[null,0,null,null,null,null,null,null,null,null,null,null,null,null,null,null,null,null,null,null,null,null,null,null,null,null,0,0]
[null,0,null,null,null,null,null,null,null,null,null,null,null,null,null,null,null,null,null,null,null,null,null,null,null,null,0,0]
[null,0,null,null,null,null,null,null,null,null,null,null,null,null,null,null,null,null,null,null,null,null,null,null,null,null,0,0]
[null,0,null,null,null,null,null,null,null,null,null,null,null,null,null,null,null,null,null,null,null,null,null,null,null,null,0,0]
[null,0,null,null,null,null,null,null,null,null,null,null,null,null,null,null,null,null,null,null,null,null,null,null,null,null,0,0]
[null,0,null,null,null,null,null,null,null,null,null,null,null,null,null,null,null,null,null,null,null,null,null,null,null,null,0,0]
[null,0,null,null,null,null,null,null,null,null,null,null,null,null,null,null,null,null,null,null,null,null,null,null,null,null,0,0]
[null,0,null,null,null,null,null,null,null,null,null,null,null,null,null,null,null,null,null,null,null,null,null,null,null,null,0,0]
[null,0,null,null,null,null,null,null,null,null,null,null,null,null,null,null,null,null,null,null,null,null,null,null,null,null,0,0]
[null,0,null,null,null,null,null,null,null,null,null,null,null,null,null,null,null,null,null,null,null,null,null,null,null,null,0,0]
[null,0,null,null,null,null,null,null,null,null,null,null,null,null,null,null,null,null,null,null,null,null,null,null,null,null,0,0]
[null,0,null,null,null,null,null,null,null,null,null,null,null,null,null,null,null,null,null,null,null,null,null,null,null,null,0,0]
{"$rows_left_out":54}
{"sheet":"МЕТОД+НАУК+ОРГАН","index":3,"n_rows":40,"n_cols":7,"rows_kept":40,"cut":false,"hidden":false,"merged":[[18,1,18,4],[30,1,30,4],[39,1,39,4]]}
[null,"II.  МЕТОДИЧНА  РОБОТА"]
["№   п/п","Зміст","Підсумковий результат","Термін виконання","Плановий обсяг,                                год","Фактичний обсяг,                    год","ВВЕДІТЬ НОМЕР\nВІД 1-106"]
[{"$f":"IF(B3=0,0,1)","v":1},{"$f":"IFERROR(VLOOKUP(G3,метод!$C$14:$D$123,2,FALSE),\" \")","v":" "}]
[{"$f":"IF(B4=\" \",\" \",A3+1)","v":" "},{"$f":"IFERROR(VLOOKUP(G4,метод!$C$14:$D$123,2,FALSE),\" \")","v":" "}]
[{"$f":"IF(B5=\" \",\" \",A4+1)","v":" "},{"$f":"IFERROR(VLOOKUP(G5,метод!$C$14:$D$123,2,FALSE),\" \")","v":" "}]
[" ",{"$f":"IFERROR(VLOOKUP(G6,метод!$C$14:$D$123,2,FALSE),\" \")","v":" "}]
[" ",{"$f":"IFERROR(VLOOKUP(G7,метод!$C$14:$D$123,2,FALSE),\" \")","v":" "}]
[" ",{"$f":"IFERROR(VLOOKUP(G8,метод!$C$14:$D$123,2,FALSE),\" \")","v":" "}]
[{"$f":"IF(B9=\" \",\" \",A8+1)","v":" "},{"$f":"IFERROR(VLOOKUP(G9,метод!$C$14:$D$123,2,FALSE),\" \")","v":" "}]
[" ",{"$f":"IFERROR(VLOOKUP(G10,метод!$C$14:$D$123,2,FALSE),\" \")","v":" "}]
[" ",{"$f":"IFERROR(VLOOKUP(G11,метод!$C$14:$D$123,2,FALSE),\" \")","v":" "}]
[{"$f":"IF(B12=\" \",\" \",A11+1)","v":" "},{"$f":"IFERROR(VLOOKUP(G12,метод!$C$14:$D$123,2,FALSE),\" \")","v":" "}]
[" ",{"$f":"IFERROR(VLOOKUP(G13,метод!$C$14:$D$123,2,FALSE),\" \")","v":" "}]
[" ",{"$f":"IFERROR(VLOOKUP(G14,метод!$C$14:$D$123,2,FALSE),\" \")","v":" "}]
[" ",{"$f":"IFERROR(VLOOKUP(G15,метод!$C$14:$D$123,2,FALSE),\" \")","v":" "}]
[{"$f":"IF(B16=\" \",\" \",A15+1)","v":" "},{"$f":"IFERROR(VLOOKUP(G16,метод!$C$14:$D$123,2,FALSE),\" \")","v":" "}]
[" ",{"$f":"IFERROR(VLOOKUP(G17,метод!$C$14:$D$123,2,FALSE),\" \")","v":" "}]
[null,null,null,"Загальна кількість годин",{"$f":"SUM(E3:E17)","v":0},{"$f":"SUM(F3:F17)","v":0}]
[null,{"$f":"CONCATENATE(\"Викладач ______________      Завідувач кафедри  ____________       / \",'НАВЧАЛЬНА РОБОТА'!AD70,\" /\")","v":"Викладач ______________      Завідувач кафедри  ____________       / Близнюк Т. П. /"}]
[null,"ІІІ. НАУКОВА РОБОТА"]
{"$rows_left_out":21}
{"sheet":"ЗМІНИ ТА ВИСНОВКИ","index":4,"n_rows":21,"n_cols":7,"rows_kept":21,"cut":false,"hidden":false,"merged":[[23,1,23,5],[24,1,24,5],[25,1,25,5],[26,1,26,5],[27,1,27,5],[22,1,22,5],[19,0,19,6],[0,0,0,5],[11,1,11,5],[12,1,12,5],[13,1,13,5],[14,1,14,5],[10,0,10,6],[15,1,15,5],[16,1,16,5],[17,1,17,5],[20,1,20,5],[21,1,21,5]]}
["V. ПЕРЕЛІК ЗМІН У ПЛАНІ РОБОТИ ВИКЛАДАЧА"]
["Семестр","Види навальної роботи ","Сутність запроваджених змін та їх обґрунтування","Плановий обсяг,                                год","Фактичний обсяг,                    год","Підстава                                                  (накази, розпорядження, протоколи засідань кафедри, лікарняні листи)","Підпис  завідувача кафедри"]
[]
[]
[]
[]
[]
[]
[]
[]
["VI.  ВИСНОВОК ПРО ВИКОНАННЯ ПЛАНУ"]
["Семестр","Зміст",null,null,null,null,"Підпис  завідувача кафедри"]
[null,{"$f":"CONCATENATE(\"Звіт про виконання індивідуального плану за \",ТИТУЛ!A34,\" навчальний рік викладача \",ТИТУЛ!A24,\" розглянуто ___  _____________ 20__ р. на засіданні кафедри \",ТИТУЛ!B12,\" й ухвалено рішення (протокол №______): Індивідуальний план виконано в обсязі \",РОЗПОДІЛ!E19,\" годин.\")","v":"Звіт про виконання індивідуального плану за 2025/2026 навчальний рік викладача  розглянуто ___  _____________ 20__ р. на засіданні кафедри Креативного менеджменту і дизайну й ухвалено рішення (протокол №______): Індивідуальний план виконано в обсязі 0 годин."}]
[null,"Пояснення щодо причин недовиконання:"]
[]
[]
[]
[]
[]
["VII. ЗАУВАЖЕННЯ ОСІБ, ЯКІ ПЕРЕВІРЯЮТЬ РОБОТУ КАФЕДРИ "]
{"$rows_left_out":2}
{"sheet":"метод","index":5,"n_rows":126,"n_cols":5,"rows_kept":126,"cut":false,"hidden":false,"merged":[]}
[]
["ПП","ПЕРЕЛІК МЕТОДИЧНИХ РОБІТ","номер"]
[]
[]
[]
[]
[]
[]
[]
[]
[]
[]
["ПП","ПЕРЕЛІК МЕТОДИЧНИХ РОБІТ","номер"]
["1.1.1","Розроблення освітньо-професійної та/ або освітньо-наукової програм підготовки фахівців",1,{"$f":"CONCATENATE(A14,\" \", B14)","v":"1.1.1 Розроблення освітньо-професійної та/ або освітньо-наукової програм підготовки фахівців"},"до 50 годин на \nпрограму "]
["1.1.2","Оновлення освітньо-професійної та/ або освітньо-наукової програм підготовки фахівців ",2,{"$f":"CONCATENATE(A15,\" \", B15)","v":"1.1.2 Оновлення освітньо-професійної та/ або освітньо-наукової програм підготовки фахівців "},"до 25 годин на програму"]
["1.2","Розроблення концепції освітньої діяльності за спеціальністю на певному рівні",3,"1.2 Розроблення концепції освітньої діяльності за спеціальністю на певному рівні","до 50 годин на концепцію"]
["1.3","Підготовка ліцензійних справ",4,"1.3 Підготовка ліцензійних справ","до 70 годин на справу"]
["1.4","Підготовка акредитаційних справ",5,"1.4 Підготовка акредитаційних справ","до 150 годин на справу"]
["1.5.1","Підготовка навчальних планів відповідної освітньо-професійної та освітньо-наукової програми",6,"1.5.1 Підготовка навчальних планів відповідної освітньо-професійної та освітньо-наукової програми","10 годин на навчальний план"]
["1.5.2","Підготовка робочих навчальних планів відповідної освітньо-професійної та освітньо-наукової програми",7,"1.5.2 Підготовка робочих навчальних планів відповідної освітньо-професійної та освітньо-наукової програми","1 година на робочий навчальний план"]
{"$rows_left_out":107}
{"sheet":"наук","index":6,"n_rows":93,"n_cols":5,"rows_kept":93,"cut":false,"hidden":false,"merged":[]}
[]
["ПП","ПЕРЕЛІК НАУКОВИХ РОБІТ","номер"]
[]
[]
[]
[]
[]
[]
[]
[]
[]
[]
["ПП","ПЕРЕЛІК НАУКОВИХ РОБІТ","номер"]
["1.1.1","Виконання затверджених планових наукових досліджень: керівнику",201,{"$f":"CONCATENATE(A14,\" \",B14)","v":"1.1.1 Виконання затверджених планових наукових досліджень: керівнику"},"керівнику: до 10 годин на на 1 ум. друк. арк."]
["1.1.2","Виконання затверджених планових наукових досліджень: виконавцю",202,{"$f":"CONCATENATE(A15,\" \",B15)","v":"1.1.2 Виконання затверджених планових наукових досліджень: виконавцю"},"виконавцю: до 50 годин на 1 ум. друк. арк. за навч рік"]
["1.2","Підготовка проєктних пропозицій на конкурс / грант, який проводять на вітчизняному або міжнародному рівні ",203,"1.2 Підготовка проєктних пропозицій на конкурс / грант, який проводять на вітчизняному або міжнародному рівні ","до 300 годин на робочу групу"]
["1.3.1","Винахідницька робота викладача: міжнародні патенти",204,"1.3.1 Винахідницька робота викладача: міжнародні патенти","міжнародні патенти: до 150 годин на 1 об'єкт"]
["1.3.2","Винахідницька робота викладача:  патенти",205,"1.3.2 Винахідницька робота викладача:  патенти","патенти: до 100 годин на 1 об'єкт"]
["1.3.3","Винахідницька робота викладача:  патенти на корисну модель",206,"1.3.3 Винахідницька робота викладача:  патенти на корисну модель","патенти на корисну модель: до 100 годин на 1 об'єкт"]
["1.3.4","Винахідницька робота викладача:  свідоцтва на твір",207,"1.3.4 Винахідницька робота викладача:  свідоцтва на твір","свідоцтва на твір: до 50 годин на 1 об'єкт"]
{"$rows_left_out":74}
{"sheet":"органз","index":7,"n_rows":76,"n_cols":5,"rows_kept":76,"cut":false,"hidden":false,"merged":[]}
[]
["ПП","ПЕРЕЛІК ОРГАНІЗАЦІЙНИХ РОБІТ","номер"]
[]
[]
[]
[]
[]
[]
[]
[]
[]
[]
["ПП","ПЕРЕЛІК ОРГАНІЗАЦІЙНИХ РОБІТ","номер"]
["1.1.1","Участь у підготовці та проведенні студентських та учнівських олімпіад: робота в організаційному комітеті",301,{"$f":"CONCATENATE(A14,\" \", B14)","v":"1.1.1 Участь у підготовці та проведенні студентських та учнівських олімпіад: робота в організаційному комітеті"},"до 20 годин на навчальний рік"]
["1.1.2","Участь у підготовці та проведенні студентських та учнівських олімпіад: проведення олімпіад",302,{"$f":"CONCATENATE(A15,\" \", B15)","v":"1.1.2 Участь у підготовці та проведенні студентських та учнівських олімпіад: проведення олімпіад"},"3 години для проведення олімпіад на потік (групу);"]
["1.1.3","Участь у підготовці та проведенні студентських та учнівських олімпіад: перевірка робіт учасника олімпіади",303,"1.1.3 Участь у підготовці та проведенні студентських та учнівських олімпіад: перевірка робіт учасника олімпіади","0,33 години на перевірку однієї роботи учасника олімпіади"]
["1.2","Участь у міжнародних Літніх школах, семінарах під патронатом МОН України, ЄС чи університетів-партнерів ХНЕУ ім. С. Кузнеця ",304,"1.2 Участь у міжнародних Літніх школах, семінарах під патронатом МОН України, ЄС чи університетів-партнерів ХНЕУ ім. С. Кузнеця ","6 годин на день (не більше 40 годин на навчальний рік)"]
["1.3","Організація та проведення освітніх та наукових заходів (конференцій, круглих столів, тематичних дискусій, виставок, конкурсів наукових робіт тощо)",305,"1.3 Організація та проведення освітніх та наукових заходів (конференцій, круглих столів, тематичних дискусій, виставок, конкурсів наукових робіт тощо)","до 20 годин на 1 захід"]
["2.1","Організація та проведення культурно-мистецьких, спортивних заходів для здобувачів вищої освіти у позанавчальний час ",306,"2.1 Організація та проведення культурно-мистецьких, спортивних заходів для здобувачів вищої освіти у позанавчальний час ","до 20 годин на 1 захід"]
["2.2","Організація та проведення культурно-мистецьких, спортивних заходів для НПП і співробітників університету",307,"2.2 Організація та проведення культурно-мистецьких, спортивних заходів для НПП і співробітників університету","до 20 годин на 1 захід"]
{"$rows_left_out":57}
{"sheet":"СПИСКИ","index":8,"n_rows":31,"n_cols":11,"rows_kept":31,"cut":false,"hidden":false,"merged":[]}
["ІНСИТУТИ / ФАКУЛЬТЕТ","код","Директор (керівник) навчально-наукового інституту / Декан","код","КАФЕДРИ","Завідувачі кафедр","ПОСАДИ","ВЧЕНЕ ЗВАННЯ","Примітка","Підсумковий результат ","Термін виконання"]
[]
["Міжнародних відносин",101,"Чернишов В.В.",101,"Міжнародних економічних відносин та безпеки бізнесу","Отенко І.П.","Завідувач кафедри","Професор","Зовнішній сумісник","Друкована праця","I семестр"]
["Економіки і права",201,"Бріль М.С.",102,"Міжнародних відносин і політичної філософії","Кузь О.М.","Професор","Доцент","Внутрішній сумісник","Рукопис","II семестр"]
["Менеджменту і маркетингу",301,"Вовк В.А.",103,"Педагогіки, іноземної філології та перекладу","Погорєлова Т. Ю.","Доцент","Старший науковий співробітник",null,null,"Протягом року"]
["Інформаційних технологій",401,"Яценко Р.М.",104,"Міжнародної економіки і менеджменту","Кот О.В.","Старший викладач","Старший дослідник"]
["Підготовки іноземних громадян",501,"Єрмоленко О.А.",105,"Статистики і економічного прогнозування","Раєвнєва О.В.","Викладач"]
[null,null,null,106,"Міжнародної торгівлі, митної справи та фінансових технологій","Тищенко В.Ф."]
[null,null,null,107,"Української філології та історії ","Черемська О.С."]
[null,null,null,201,"Соціальної економіки","Назарова Г.В."]
[null,null,null,202,"Економіки підприємства та організації бізнесу","Власенко Т.А."]
[null,null,null,203,"Правового регулювання економіки","Шинкарьов Ю. В."]
[null,null,null,204,"Державного управління, публічного адміністрування та економічної політики","Гавкалова Н.Л."]
[null,null,null,205,"Фінансів і кредиту ","Журавльова І.В."]
[null,null,null,206,"Підприємництва, торгівлі та туристичного бізнесу","Салун М.М."]
[null,null,null,207,"Готельного, ресторанного бізнесу і крафтових технологій","Давидова О.Ю."]
[null,null,null,208,"Обліку і бізнес-консалтингу","Пилипенко А.А."]
[null,null,null,301,"Менеджменту, логістики та інновацій","Ястремська О.М."]
[null,null,null,302,"Менеджменту, бізнесу і адміністрування","Лепейко Т. І."]
[null,null,null,303,"Маркетингу","Гриневич Л.В."]
{"$rows_left_out":11}